{"text_format":"1","workbook":"xlsx","n_sheets":6,"sheets":["Formato Caracterización","Hoja1","Recomendaciones","Consulta de Grupos de Valor","Listas Desplegables","Consulta Listas Desplegables"],"not_rendered":{"charts":0,"images":3,"macros":1,"external_links":0,"defined_names":10,"comments":0,"pivot_tables":0},"unopened":[],"bounds":{"document_bytes":16777216,"sheet_cells":100000,"rows_first":2000,"rows_last":500,"rows_between":2000,"halvings":0,"cell_chars":16384,"cell_head_chars":4096},"cells_cut":0,"cells_raw":0,"read":"whole","date_system":"1900"}

{"sheet":"Formato Caracterización","index":0,"n_rows":126,"n_cols":95,"rows_kept":126,"cut":false,"hidden":false,"merged":[[6,1,6,7],[6,8,6,15],[6,94,6,96],[6,90,6,93],[1,1,4,97],[6,38,6,52],[42,1,47,19],[39,61,39,80],[39,57,39,60],[38,57,38,60],[38,20,38,28],[39,20,39,28],[38,1,41,19],[45,29,47,36],[39,29,39,36],[41,29,41,36],[40,29,40,36],[41,57,41,60],[41,20,41,28],[40,57,40,60],[45,20,47,28],[24,1,24,24],[24,26,24,96],[25,1,25,24],[25,26,25,96],[42,20,44,28],[42,37,47,56],[48,20,48,28],[48,29,48,36],[59,20,62,28],[59,57,62,60],[62,61,62,80],[62,89,62,96],[54,57,54,60],[54,61,54,80],[54,89,54,96],[56,57,56,60],[56,61,56,80],[56,29,57,36],[56,20,57,28],[62,81,62,88],[51,89,51,96],[53,61,53,80],[59,29,62,36],[59,37,62,56],[59,81,59,88],[61,81,61,88],[54,37,57,56],[54,29,55,36],[65,1,67,19],[65,20,65,28],[65,29,65,36],[65,37,67,56],[65,57,66,60],[66,20,66,28],[66,29,66,36],[67,20,67,28],[67,29,67,36],[67,57,67,60],[42,29,44,36],[61,89,61,96],[63,29,64,36],[63,20,64,28],[64,61,64,80],[64,81,64,88],[60,81,60,88],[60,89,60,96],[47,89,47,96],[64,89,64,96],[63,81,63,88],[56,81,56,88],[63,61,63,80],[59,61,59,80],[57,89,57,96],[59,89,59,96],[61,61,61,80],[54,81,54,88],[53,81,53,88],[56,89,56,96],[55,89,55,96],[53,89,53,96],[58,1,58,96],[57,81,57,88],[89,49,89,96],[84,1,84,47],[85,1,85,47],[86,1,86,47],[75,74,75,96],[76,74,76,96],[75,49,75,72],[76,49,76,72],[78,1,78,47],[79,1,79,47],[79,49,79,72],[82,49,82,96],[76,1,76,47],[80,1,80,47],[77,49,77,72],[77,1,77,47],[78,74,78,96],[79,74,79,96],[80,74,80,96],[78,49,78,72],[87,1,87,47],[88,1,88,47],[89,1,89,47],[84,49,84,96],[63,89,63,96],[63,37,64,56],[57,61,57,80],[63,1,64,19],[63,57,64,60],[54,1,57,19],[59,1,62,19],[123,72,123,96],[125,65,125,70],[125,72,125,96],[119,1,119,32],[121,9,121,32],[123,9,123,32],[125,9,125,32],[119,34,119,63],[121,34,121,39],[125,1,125,7],[123,1,123,7],[121,1,121,7],[121,41,121,63],[123,34,123,39],[123,41,123,63],[125,34,125,39],[125,41,125,63],[119,65,119,96],[121,72,121,96],[123,65,123,70],[121,65,121,70],[11,70,11,96],[11,18,11,55],[11,56,11,69],[11,1,11,17],[8,1,8,96],[6,31,6,37],[6,81,6,87],[10,1,10,17],[10,18,10,69],[10,70,10,82],[10,83,10,96],[12,1,12,17],[13,18,13,96],[14,18,14,96],[13,1,13,17],[29,1,29,96],[31,20,31,36],[31,81,31,96],[18,1,18,24],[18,26,18,96],[20,1,20,24],[22,1,22,24],[23,1,23,24],[26,1,26,24],[12,18,12,96],[26,26,26,96],[27,1,27,24],[31,1,33,19],[33,20,33,28],[28,1,28,96],[16,1,16,96],[20,26,20,96],[21,26,21,96],[22,26,22,96],[23,26,23,96],[27,26,27,96],[21,1,21,24],[14,1,14,17],[85,49,85,96],[86,49,86,96],[87,49,87,96],[88,49,88,96],[77,74,77,96],[80,49,80,72],[82,1,82,47],[33,29,33,36],[31,37,33,56],[31,57,33,60],[31,61,33,80],[37,61,37,80],[36,61,36,80],[40,89,41,96],[33,81,33,88],[33,89,33,96],[35,1,35,96],[71,49,71,96],[40,81,41,88],[39,81,39,88],[57,57,57,60],[60,61,60,80],[54,20,55,28],[51,37,53,56],[112,32,113,77],[93,1,93,96],[91,1,91,96],[103,1,103,3],[101,1,101,3],[102,1,102,3],[97,83,97,96],[97,5,97,82],[95,1,95,96],[97,1,97,3],[99,5,99,82],[103,83,103,96],[102,83,102,96],[100,5,100,82],[101,5,101,82],[102,5,102,82],[103,5,103,82],[112,18,113,30],[117,1,117,96],[99,1,99,3],[106,1,106,96],[110,79,111,96],[108,79,108,96],[108,1,108,17],[108,18,108,30],[108,32,108,77],[100,1,100,3],[110,1,111,17],[110,18,111,30],[110,32,111,77],[104,1,104,3],[99,83,99,96],[100,83,100,96],[101,83,101,96],[104,83,104,96],[112,79,113,96],[114,1,115,17],[114,18,115,30],[114,32,115,77],[114,79,115,96],[104,5,104,82],[112,1,113,17],[45,61,45,80],[43,61,43,80],[52,61,52,80],[52,81,52,88],[52,89,52,96],[43,89,44,96],[55,61,55,80],[55,57,55,60],[55,81,55,88],[42,57,47,60],[42,61,42,80],[42,89,42,96],[44,61,44,80],[44,81,44,88],[43,81,43,88],[46,89,46,96],[42,81,42,88],[65,81,67,88],[65,61,67,80],[65,89,67,96],[69,1,69,96],[48,37,49,56],[39,89,39,96],[38,89,38,96],[38,81,38,88],[38,37,41,56],[40,20,40,28],[38,61,38,80],[40,61,41,80],[38,29,38,36],[50,1,50,96],[51,1,53,19],[51,81,51,88],[45,89,45,96],[46,61,46,80],[45,81,45,88],[46,81,46,88],[47,81,47,88],[48,81,48,88],[49,81,49,88],[47,61,47,80],[36,37,37,56],[36,57,37,60],[36,1,36,19],[36,89,37,96],[36,81,37,88],[37,1,37,19],[36,20,37,28],[36,29,37,36],[75,1,75,47],[71,1,73,47],[73,74,73,96],[73,49,73,72],[48,57,49,60],[51,57,53,60],[51,20,53,28],[51,29,53,36],[48,61,48,80],[48,89,48,96],[48,1,49,19],[49,20,49,28],[49,29,49,36],[49,61,49,80],[49,89,49,96],[51,61,51,80]]}
[]
[null,"CARACTERIZACIÓN DE PROCESO"]
[]
[]
[]
[]
[null,"Código: ",null,null,null,null,null,null,{"$f":"CONCATENATE(CF11,\".\",\"CP\")","v":"Mis.2.1.CP"},null,null,null,null,null,null,null,null,null,null,null,null,null,null,null,null,null,null,null,null,null,null,"Fecha: ",null,null,null,null,null,null,"2023-06-21",null,null,null,null,null,null,null,null,null,null,null,null,null,null,null,null,null,null,null,null,null,null,null,null,null,null,null,null,null,null,null,null,null,null,null,null,null,null,null,null,null,null,null,null,null,null,null,null,null,null,null,"Versión",null,null,null,9]
[]
{"$rows_left_out":119}
{"sheet":"Hoja1","index":1,"n_rows":44,"n_cols":5,"rows_kept":44,"cut":false,"hidden":true,"merged":[]}
["Procesos","Código de Procesos","Líder del proceso","Tipo de proceso","Dependencia"]
["Est.1.1 Planeación estratégica sectorial e institucional","Est.1.1","Jefe Oficina Asesora de Planeación","Estratégico","Oficina Asesora de Planeación "]
["Est.1.4 Administración, mejoramiento e innovación del SUG","Est.1.4","Jefe Oficina Asesora de Planeación","Estratégico","Oficina Asesora de Planeación "]
["Est.2.1 Gestión de Comunicaciones","Est.2.1","Asesor de Comunicaciones","Estratégico","Despacho del Ministro - Comunicaciones "]
["Mis.1.1 Coordinación y seguimiento de la Política Macroeconómica y Fiscal","Mis.1.1","Director General de Política Macroeconómica","Misional","Dirección General de Política Macroeconómica "]
["Mis.2.1 Programación Presupuestal de los recursos de la Nación","Mis.2.1","Director General de Presupuesto Público Nacional","Misional","Dirección General de Presupuesto Público Nacional"]
["Mis.2.2 Administración y seguimiento a la ejecución presupuestal","Mis.2.2","Director General de Presupuesto Público Nacional","Misional","Dirección General de Presupuesto Público Nacional"]
["Mis.3.1 Financiamiento Interno del PGN","Mis.3.1","Subdirector de Financiamiento Interno de la Nación","Misional","Subdirección de Financiamiento Interno de la Nación "]
{"$rows_left_out":37}
{"sheet":"Recomendaciones","index":2,"n_rows":12,"n_cols":4,"rows_kept":12,"cut":false,"hidden":true,"merged":[[11,0,11,1],[7,2,8,2],[1,0,5,0],[0,0,0,1],[7,0,8,1],[6,0,6,1],[9,0,9,1],[10,0,10,1]]}
["No.",null,"Nombre del numeral","Recomendación"]
[1,"1.1","Nombre del proceso","Seleccione el nombre del proceso a caracterizar"]
[null,"1.2","Líder (es)","Seleccione el cargo del responsable del proceso. Si en el proceso hay un liderazgo compartido, por favor ubique al final de la lista, la opción que involucre a los diferentes cargos. "]
[null,"1.4","Tipo de Proceso","Seleccione el tipo de proceso, teniendo en cuenta el inventario o mapa de procesos "]
[null,"1.5","Objetivo","Establezca de manera concisa, el propósito del proceso: \n\nLa redacción debe iniciar con un verbo en infinitivo (ar, er, ir) y debe contemplar los fines, metas, o productos finales que se buscan obtener con la ejecución del proceso. \n\nRespondiendo las siguientes preguntas podrá determinar de una forma más fácil el objetivo de su proceso: \n\n1. ¿Qué hace?   Enuncie la actividad principal del proceso. Recuerde que debe iniciar con un verbo en infinitivo\n2. ¿Cómo lo hace?   Describa las actividades que le permiten atender el quehacer del proceso. Recuerde que debe estar directamente relacionado con el propósito fijado \n3. ¿Para qué lo hace? Establezca lo que se quiere alcanzar en términos de calidad, oportunidad, eficiencia, satisfacción o mejoramiento, entre otros.\n\nEjemplo:\n\n(Qué hace) Gestionar el talento humano de la Entidad, (¿Cómo lo hace?) mediante la provisión, tramite de novedades, la evaluación de los servidores públicos y la administración de las historias laborales de acuerdo con la normatividad vigente, (¿para qué lo hace?) para asegurar la operación institucional.\n\nNota: Para la formulación del objetivo evite utilizar verbos como: Propiciar, Propender, Coadyuvar, Apoyar, Integrar, Fomentar, Colaborar, Contribuir, Garantizar, Velar; los cuales no permiten orientar o delimitar el accionar del proceso."]
[null,"1.7","Alcance","Bajo una secuencia lógica, describa brevemente la actividad principal con la que inicia el desarrollo del proceso y la actividad con la que culmina.Cuando en el proceso se desarrollan actividades que no se encuentran dentro de la secuencia lógica (cadena de valor), menciónelas luego de la palabra \"Cubre\", \n\nEjemplo:\n\n(Desde) Recepción de los bienes y servicios del MHCP (Hasta) Enajenación, pérdida, donación y/o eliminación del bien y/o finalización del servicio Cubre:  El mantenimiento de los bienes e infraestructura y la prestación de los servicios logísticos."]
[2,null,"Productos Finales","Liste los productos en el orden en que se generan, de acuerdo al objetivo y el alcance del proceso e incluya una breve descripción y/o definición de este. "]
[3,null,"PHVM","A partir de la identificación de los productos finales  realizada en la etapa anterior:\n\nPaso 1. Liste nuevamente los productos finales en la casilla \"Salidas\" \nPaso 2. Seleccione los destinatarios internos o externos de los productos que enlistó el paso No.1  en la casilla: Grupos de Valor (Destinatarios) \nPaso 3. Defina las principales actividades del proceso que conllevan al desarrollo de esos productos en la casilla  \"Principales Actividades\"  \nPaso 4. Identifique de esas actividades cuales son del: Planear, Hacer, Verificar o Mejorar\nPaso 5. Identifique los principales insumos  ( políticas, documentos normativos o metodológicos, etc. ) que permiten iniciar cada actividad en la casilla \"Entradas\"\nPaso 6. Seleccione los proveedores internos o externos de las entradas que listó en el paso No.7  en la casilla: Grupos de Valor (Proveedores) \n\nTenga en cuenta que la identificación de las entradas, principales actividades y de los productos y servicios deben guardar relación con cada una de las cuatro etapas (Planear - Hacer - Verificar -Actuar). Haciéndolo de esta manera asegurará que podrá dar a conocer a sus grupos de valor (Proveedores - Destinatarios) de forma clara la información que desarrolla su proceso y cómo intervienen ellos."]
{"$rows_left_out":5}
{"sheet":"Consulta de Grupos de Valor","index":3,"n_rows":159,"n_cols":4,"rows_kept":159,"cut":false,"hidden":true,"merged":[[1,1,1,3]]}
[]
[null,"GRUPOS DE VALOR"]
[]
[null,"Internos",null,"Externos"]
[]
[null,"Alta Dirección del MHCP",null,"Academia"]
[null,"Dependencias y/o procesos del Ministerio de Hacienda y Crédito Público MHCP",null,"Administradoras de Fondos de Pensiones - AFP"]
[null,"Usuarios SIIF Nación",null,"Agencia Nacional de Hidrocarburos"]
{"$rows_left_out":152}
{"sheet":"Listas Desplegables","index":4,"n_rows":157,"n_cols":74,"rows_kept":157,"cut":false,"hidden":true,"merged":[[0,5,0,6],[0,7,0,8]]}
["PHVM","Tipo de proceso","Área o Dependencia","Procesos","Código de Procesos","Proveedores",null,"Destinatarios",null,"Entradas","Salidas","Líder del proceso","Aplicativo","Estado en SUIT","Tipos de Productos","Trámites u OPA"]
["Seleccione una opción","Seleccione una opción","Seleccione una opción","Seleccione una opción","Seleccione una opción","Internos","Externos","Internos","Externos","Seleccione una opción","Seleccione una opción","Seleccione una opción","Seleccione una opción","Seleccione una opción","Seleccione una opción","Seleccione una opción"]
["Planear","Misional","1. Despacho del Ministro","Est.1.1 Planeación estratégica sectorial e institucional","Est.1.1","Seleccione una opción","Seleccione una opción","Seleccione una opción","Seleccione una opción","Campañas o estrategias para divulgación por redes sociales","Afectaciones contables y presupuestales correspondientes.","Asesor de Comunicaciones","Activos Fijos","Registrado en SUIT","Legal","Trámite"]
["Hacer","Apoyo","1.1 Oficina Asesora de Jurídica","Est.1.4 Administración, mejoramiento e innovación del SUG","Est.1.4","Alta Dirección del MHCP","Academia","Alta Dirección del MHCP","Academia","Cuenta Bancaria Activa","Archivos de Pago.","Asesor Subdirección de Apoyo al Saneamiento Fiscal y Territorial","Almacen de Consumo","Sin Registro","Cliente","OPA"]
["Verificar","Evaluación","2. Despacho del Viceministro General","Est.2.1 Gestión de Comunicaciones","Est.2.1","Dependencias y/o procesos del Ministerio de Hacienda y Crédito Público MHCP","Administradoras de Fondos de Pensiones - AFP","Dependencias y/o procesos del Ministerio de Hacienda y Crédito Público MHCP","Administradoras de Fondos de Pensiones - AFP","Cuentas bancarias DTN","Asesoría","Asesor Viceministerio General","Aplicativo De Seguimiento De Acreencias (ASA)",null,"Funcional"]
["Mejorar","Estratégico","2.1 Oficina de Control Interno","Mis.1.1 Coordinación y seguimiento de la Política Macroeconómica y Fiscal","Mis.1.1","Usuarios SIIF Nación","Agencia Nacional de Hidrocarburos","Usuarios SIIF Nación","Agencia Nacional de Hidrocarburos","Decisión de colocación de excedentes","Capacitación","Coordinador Grupo de Administración de Sobretasa a la Gasolina y ACPM","BI- Banca de Inversión",null,"Legal y Cliente"]
[null,null,"2.2 Oficina Asesora de Planeación","Mis.2.1 Programación Presupuestal de los recursos de la Nación","Mis.2.1","Servidores Públicos del MHCP","Agencia Nacional de Minería","Servidores Públicos del MHCP","Agencia Nacional de Minería","Acreedores varios por recursos de la Nación sujetos a devolución."," PAC actualizado","Coordinador Grupo de Administración del SIIF","BI- Seguimiento Fiscal",null,"Legal y Funcional",null,null,null,null,null,null,null,null,null,null,null,null,null,null,null,null,null,null,null,null,null,null,null,null,null,null,null,null,null,null,null,null,null,null,null,null,null,null,null,null,null,null,null,null,null,null,null,null,null,null,null,null,null,null,null,null,null,null,{"$f":"VLOOKUP('Listas Desplegables'!D3,'Listas Desplegables'!E3:E45,1,FALSE)","v":{"$error":"#N/A"}}]
[null,null,"2.3 Oficina de Bonos Pensionales","Mis.2.2 Administración y seguimiento a la ejecución presupuestal","Mis.2.2","Contratistas del MHCP ","Agencias Calificadoras de Riesgo","Contratistas del MHCP ","Agencias Calificadoras de Riesgo","Decreto de liquidación.","Comunicados Boletines, Videos, Fotografía, Asistencia Foros del Ministro\nIntranet Piezas de comunicación","Coordinador Grupo de Contratación Directa","BI-Participación estatal",null,"Funcional y Cliente "]
{"$rows_left_out":150}
{"sheet":"Consulta Listas Desplegables","index":5,"n_rows":166,"n_cols":74,"rows_kept":166,"cut":false,"hidden":true,"merged":[]}
[{"$f":"'Listas Desplegables'!A1","v":"PHVM"},{"$f":"'Listas Desplegables'!B1","v":"Tipo de proceso"},{"$f":"'Listas Desplegables'!C1","v":"Área o Dependencia"},{"$f":"'Listas Desplegables'!D1","v":"Procesos"},{"$f":"'Listas Desplegables'!E1","v":"Código de Procesos"},{"$f":"'Listas Desplegables'!F1","v":"Proveedores"},{"$f":"'Listas Desplegables'!G1","v":0},{"$f":"'Listas Desplegables'!H1","v":"Destinatarios"},{"$f":"'Listas Desplegables'!I1","v":0},{"$f":"'Listas Desplegables'!J1","v":"Entradas"},{"$f":"'Listas Desplegables'!K1","v":"Salidas"},{"$f":"'Listas Desplegables'!L1","v":"Líder del proceso"},{"$f":"'Listas Desplegables'!M1","v":"Aplicativo"},{"$f":"'Listas Desplegables'!N1","v":"Estado en SUIT"},{"$f":"'Listas Desplegables'!O1","v":"Tipos de Productos"},{"$f":"'Listas Desplegables'!P1","v":"Trámites u OPA"}]
[{"$f":"'Listas Desplegables'!A2","v":"Seleccione una opción"},{"$f":"'Listas Desplegables'!B2","v":"Seleccione una opción"},{"$f":"'Listas Desplegables'!C2","v":"Seleccione una opción"},{"$f":"'Listas Desplegables'!D2","v":"Seleccione una opción"},{"$f":"'Listas Desplegables'!E2","v":"Seleccione una opción"},{"$f":"'Listas Desplegables'!F2","v":"Internos"},{"$f":"'Listas Desplegables'!G2","v":"Externos"},{"$f":"'Listas Desplegables'!H2","v":"Internos"},{"$f":"'Listas Desplegables'!I2","v":"Externos"},{"$f":"'Listas Desplegables'!J2","v":"Seleccione una opción"},{"$f":"'Listas Desplegables'!K2","v":"Seleccione una opción"},{"$f":"'Listas Desplegables'!L2","v":"Seleccione una opción"},{"$f":"'Listas Desplegables'!M2","v":"Seleccione una opción"},{"$f":"'Listas Desplegables'!N2","v":"Seleccione una opción"},{"$f":"'Listas Desplegables'!O2","v":"Seleccione una opción"},{"$f":"'Listas Desplegables'!P2","v":"Seleccione una opción"}]
[{"$f":"'Listas Desplegables'!A3","v":"Planear"},{"$f":"'Listas Desplegables'!B3","v":"Misional"},{"$f":"'Listas Desplegables'!C3","v":"1. Despacho del Ministro"},{"$f":"'Listas Desplegables'!D3","v":"Est.1.1 Planeación estratégica sectorial e institucional"},{"$f":"'Listas Desplegables'!E3","v":"Est.1.1"},{"$f":"'Listas Desplegables'!F3","v":"Seleccione una opción"},{"$f":"'Listas Desplegables'!G3","v":"Seleccione una opción"},{"$f":"'Listas Desplegables'!H3","v":"Seleccione una opción"},{"$f":"'Listas Desplegables'!I3","v":"Seleccione una opción"},{"$f":"'Listas Desplegables'!J3","v":"Campañas o estrategias para divulgación por redes sociales"},{"$f":"'Listas Desplegables'!K3","v":"Afectaciones contables y presupuestales correspondientes."},{"$f":"'Listas Desplegables'!L3","v":"Asesor de Comunicaciones"},{"$f":"'Listas Desplegables'!M3","v":"Activos Fijos"},{"$f":"'Listas Desplegables'!N3","v":"Registrado en SUIT"},{"$f":"'Listas Desplegables'!O3","v":"Legal"},{"$f":"'Listas Desplegables'!P3","v":"Trámite"}]
[{"$f":"'Listas Desplegables'!A4","v":"Hacer"},{"$f":"'Listas Desplegables'!B4","v":"Apoyo"},{"$f":"'Listas Desplegables'!C4","v":"1.1 Oficina Asesora de Jurídica"},{"$f":"'Listas Desplegables'!D4","v":"Est.1.4 Administración, mejoramiento e innovación del SUG"},{"$f":"'Listas Desplegables'!E4","v":"Est.1.4"},{"$f":"'Listas Desplegables'!F4","v":"Alta Dirección del MHCP"},{"$f":"'Listas Desplegables'!G4","v":"Academia"},{"$f":"'Listas Desplegables'!H4","v":"Alta Dirección del MHCP"},{"$f":"'Listas Desplegables'!I4","v":"Academia"},{"$f":"'Listas Desplegables'!J4","v":"Cuenta Bancaria Activa"},{"$f":"'Listas Desplegables'!K4","v":"Archivos de Pago."},{"$f":"'Listas Desplegables'!L4","v":"Asesor Subdirección de Apoyo al Saneamiento Fiscal y Territorial"},{"$f":"'Listas Desplegables'!M4","v":"Almacen de Consumo"},{"$f":"'Listas Desplegables'!N4","v":"Sin Registro"},{"$f":"'Listas Desplegables'!O4","v":"Cliente"},{"$f":"'Listas Desplegables'!P4","v":"OPA"}]
[{"$f":"'Listas Desplegables'!A5","v":"Verificar"},{"$f":"'Listas Desplegables'!B5","v":"Evaluación"},{"$f":"'Listas Desplegables'!C5","v":"2. Despacho del Viceministro General"},{"$f":"'Listas Desplegables'!D5","v":"Est.2.1 Gestión de Comunicaciones"},{"$f":"'Listas Desplegables'!E5","v":"Est.2.1"},{"$f":"'Listas Desplegables'!F5","v":"Dependencias y/o procesos del Ministerio de Hacienda y Crédito Público MHCP"},{"$f":"'Listas Desplegables'!G5","v":"Administradoras de Fondos de Pensiones - AFP"},{"$f":"'Listas Desplegables'!H5","v":"Dependencias y/o procesos del Ministerio de Hacienda y Crédito Público MHCP"},{"$f":"'Listas Desplegables'!I5","v":"Administradoras de Fondos de Pensiones - AFP"},{"$f":"'Listas Desplegables'!J5","v":"Cuentas bancarias DTN"},{"$f":"'Listas Desplegables'!K5","v":"Asesoría"},{"$f":"'Listas Desplegables'!L5","v":"Asesor Viceministerio General"},{"$f":"'Listas Desplegables'!M5","v":"Aplicativo De Seguimiento De Acreencias (ASA)"},{"$f":"'Listas Desplegables'!N5","v":0},{"$f":"'Listas Desplegables'!O5","v":"Funcional"},{"$f":"'Listas Desplegables'!P5","v":0}]
[{"$f":"'Listas Desplegables'!A6","v":"Mejorar"},{"$f":"'Listas Desplegables'!B6","v":"Estratégico"},{"$f":"'Listas Desplegables'!C6","v":"2.1 Oficina de Control Interno"},{"$f":"'Listas Desplegables'!D6","v":"Mis.1.1 Coordinación y seguimiento de la Política Macroeconómica y Fiscal"},{"$f":"'Listas Desplegables'!E6","v":"Mis.1.1"},{"$f":"'Listas Desplegables'!F6","v":"Usuarios SIIF Nación"},{"$f":"'Listas Desplegables'!G6","v":"Agencia Nacional de Hidrocarburos"},{"$f":"'Listas Desplegables'!H6","v":"Usuarios SIIF Nación"},{"$f":"'Listas Desplegables'!I6","v":"Agencia Nacional de Hidrocarburos"},{"$f":"'Listas Desplegables'!J6","v":"Decisión de colocación de excedentes"},{"$f":"'Listas Desplegables'!K6","v":"Capacitación"},{"$f":"'Listas Desplegables'!L6","v":"Coordinador Grupo de Administración de Sobretasa a la Gasolina y ACPM"},{"$f":"'Listas Desplegables'!M6","v":"BI- Banca de Inversión"},{"$f":"'Listas Desplegables'!N6","v":0},{"$f":"'Listas Desplegables'!O6","v":"Legal y Cliente"},{"$f":"'Listas Desplegables'!P6","v":0}]
[{"$f":"'Listas Desplegables'!A7","v":0},{"$f":"'Listas Desplegables'!B7","v":0},{"$f":"'Listas Desplegables'!C7","v":"2.2 Oficina Asesora de Planeación"},{"$f":"'Listas Desplegables'!D7","v":"Mis.2.1 Programación Presupuestal de los recursos de la Nación"},{"$f":"'Listas Desplegables'!E7","v":"Mis.2.1"},{"$f":"'Listas Desplegables'!F7","v":"Servidores Públicos del MHCP"},{"$f":"'Listas Desplegables'!G7","v":"Agencia Nacional de Minería"},{"$f":"'Listas Desplegables'!H7","v":"Servidores Públicos del MHCP"},{"$f":"'Listas Desplegables'!I7","v":"Agencia Nacional de Minería"},{"$f":"'Listas Desplegables'!J7","v":"Acreedores varios por recursos de la Nación sujetos a devolución."},{"$f":"'Listas Desplegables'!K7","v":" PAC actualizado"},{"$f":"'Listas Desplegables'!L7","v":"Coordinador Grupo de Administración del SIIF"},{"$f":"'Listas Desplegables'!M7","v":"BI- Seguimiento Fiscal"},{"$f":"'Listas Desplegables'!N7","v":0},{"$f":"'Listas Desplegables'!O7","v":"Legal y Funcional"},{"$f":"'Listas Desplegables'!P7","v":0},null,null,null,null,null,null,null,null,null,null,null,null,null,null,null,null,null,null,null,null,null,null,null,null,null,null,null,null,null,null,null,null,null,null,null,null,null,null,null,null,null,null,null,null,null,null,null,null,null,null,null,null,null,null,null,null,null,{"$f":"VLOOKUP('Consulta Listas Desplegables'!D3,'Consulta Listas Desplegables'!E3:E45,1,FALSE)","v":{"$error":"#N/A"}}]
[{"$f":"'Listas Desplegables'!A8","v":0},{"$f":"'Listas Desplegables'!B8","v":0},{"$f":"'Listas Desplegables'!C8","v":"2.3 Oficina de Bonos Pensionales"},{"$f":"'Listas Desplegables'!D8","v":"Mis.2.2 Administración y seguimiento a la ejecución presupuestal"},{"$f":"'Listas Desplegables'!E8","v":"Mis.2.2"},{"$f":"'Listas Desplegables'!F8","v":"Contratistas del MHCP "},{"$f":"'Listas Desplegables'!G8","v":"Agencias Calificadoras de Riesgo"},{"$f":"'Listas Desplegables'!H8","v":"Contratistas del MHCP "},{"$f":"'Listas Desplegables'!I8","v":"Agencias Calificadoras de Riesgo"},{"$f":"'Listas Desplegables'!J8","v":"Decreto de liquidación."},{"$f":"'Listas Desplegables'!K8","v":"Comunicados Boletines, Videos, Fotografía, Asistencia Foros del Ministro\nIntranet Piezas de comunicación"},{"$f":"'Listas Desplegables'!L8","v":"Coordinador Grupo de Contratación Directa"},{"$f":"'Listas Desplegables'!M8","v":"BI-Participación estatal"},{"$f":"'Listas Desplegables'!N8","v":0},{"$f":"'Listas Desplegables'!O8","v":"Funcional y Cliente "},{"$f":"'Listas Desplegables'!P8","v":0}]
{"$rows_left_out":158}